Welcome, guest! Login / Register - Why register?

Paste

N/A
Pasted as Bash by DesT ( 11 years ago )
NOTE: Running task 287 of 464 (ID: 7, /home/dest/stuff/openembedded/packages/linux/linux_2.6.21.bb, do_compile)
NOTE: package linux-2.6.21: started
NOTE: package linux-2.6.21-r12: task do_compile: started
ERROR: function do_compile failed
ERROR: log data follows (/media/storage/stuff/build/tmp/work/x86-angstrom-linux/linux-2.6.21-r12/temp/log.do_compile.6875)
| NOTE: make -e MAKEFLAGS= include/linux/version.h CC=ccache i486-angstrom-linux-gcc  LD=i486-angstrom-linux-ld
|   CHK     include/linux/version.h
| NOTE: make -e MAKEFLAGS= bzImage CC=ccache i486-angstrom-linux-gcc  LD=i486-angstrom-linux-ld
|   CHK     include/linux/version.h
|   CHK     include/linux/utsrelease.h
| make[1]: Entering directory `/media/storage/stuff/build/tmp/work/x86-angstrom-linux/linux-2.6.21-r12/linux-2.6.21'
| make[1]: Leaving directory `/media/storage/stuff/build/tmp/work/x86-angstrom-linux/linux-2.6.21-r12/linux-2.6.21'
| make[1]: Entering directory `/media/storage/stuff/build/tmp/work/x86-angstrom-linux/linux-2.6.21-r12/linux-2.6.21'
| make[1]: Leaving directory `/media/storage/stuff/build/tmp/work/x86-angstrom-linux/linux-2.6.21-r12/linux-2.6.21'
| make[1]: Entering directory `/media/storage/stuff/build/tmp/work/x86-angstrom-linux/linux-2.6.21-r12/linux-2.6.21'
| make[2]: Entering directory `/media/storage/stuff/build/tmp/work/x86-angstrom-linux/linux-2.6.21-r12/linux-2.6.21'
| make[2]: Leaving directory `/media/storage/stuff/build/tmp/work/x86-angstrom-linux/linux-2.6.21-r12/linux-2.6.21'
| make[2]: Entering directory `/media/storage/stuff/build/tmp/work/x86-angstrom-linux/linux-2.6.21-r12/linux-2.6.21'
|   HOSTCC  scripts/mod/sumversion.o
| scripts/mod/sumversion.c: In function 'get_src_version':
| scripts/mod/sumversion.c:384: error: 'PATH_MAX' undeclared (first use in this function)
| scripts/mod/sumversion.c:384: error: (Each undeclared identifier is reported only once
| scripts/mod/sumversion.c:384: error: for each function it appears in.)
| scripts/mod/sumversion.c:384: warning: unused variable 'filelist'
| make[2]: *** [scripts/mod/sumversion.o] Error 1
| make[2]: Leaving directory `/media/storage/stuff/build/tmp/work/x86-angstrom-linux/linux-2.6.21-r12/linux-2.6.21'
| make[1]: *** [scripts/mod] Error 2
| make[1]: Leaving directory `/media/storage/stuff/build/tmp/work/x86-angstrom-linux/linux-2.6.21-r12/linux-2.6.21'
| make: *** [scripts] Error 2
| FATAL: oe_runmake failed
NOTE: Task failed: /media/storage/stuff/build/tmp/work/x86-angstrom-linux/linux-2.6.21-r12/temp/log.do_compile.6875
NOTE: package linux-2.6.21-r12: task do_compile: failed
ERROR: TaskFailed event exception, aborting
NOTE: package linux-2.6.21: failed
ERROR: Build of /home/dest/stuff/openembedded/packages/linux/linux_2.6.21.bb do_compile failed
ERROR: Task 7 (/home/dest/stuff/openembedded/packages/linux/linux_2.6.21.bb, do_compile) failed
NOTE: Tasks Summary: Attempted 286 tasks of which 286 didn't need to be rerun and 1 failed.
ERROR: '/home/dest/stuff/openembedded/packages/linux/linux_2.6.21.bb' failed

 

Revise this Paste

Your Name: Code Language: