/bin/sh: ../../common/scangobj-merge.py: /usr/bin/python: bad interpreter: No such file or directory
make[3]: *** [scanobj-build.stamp] Error 126
make[3]: Leaving directory `/home/abuild/rpmbuild/BUILD/gst-plugins-base-0.10.32/docs/plugins'
make[2]: *** [all-recursive] Error 1
make[2]: Leaving directory `/home/abuild/rpmbuild/BUILD/gst-plugins-base-0.10.32/docs'
make[1]: *** [all-recursive] Error 1
make[1]: Leaving directory `/home/abuild/rpmbuild/BUILD/gst-plugins-base-0.10.32'
make: *** [all] Error 2
error: Bad exit status from /var/tmp/rpm-tmp.waWHub (%build)
RPM build errors:
Bad exit status from /var/tmp/rpm-tmp.waWHub (%build)
Add a code snippet to your website: www.paste.org